Reaction Details
TargetMatrix metalloproteinase-9
LigandBDBM50128642
Substrate/Competitorn/a
Meas. Tech.ChEMBL_105516 (CHEMBL715225)
IC50 11±n/a nM
Citation Aranapakam, VDavis, JMGrosu, GTBaker, JEllingboe, JZask, ALevin, JISandanayaka, VPDu, MSkotnicki, JSDiJoseph, JFSung, ASharr, MAKillar, LMWalter, TJin, GCowling, RTillett, JZhao, WMcDevitt, JXu, ZB Synthesis and structure-activity relationship of N-substituted 4-arylsulfonylpiperidine-4-hydroxamic acids as novel, orally active matrix metalloproteinase inhibitors for the treatment of osteoarthritis. J Med Chem46:2376-96 (2003) 
 
Matrix metalloproteinase-9
Name:Matrix metalloproteinase-9
Type:Enzyme
Mol. Mass.:78452.28
Organism:Homo sapiens (Human)
Description:P14780
Residue:707
BDBM50128642
NameBDBM50128642
Synonyms:1-(4-(thiophen-2-yl)benzyl)-N-hydroxy-4-(4-methoxyphenylsulfonyl)piperidine-4-carboxamide CHEMBL80183
TypeSmall organic molecule
Emp. Form.C24H26N2O5S2
Mol. Mass.486.604
SMILESCOc1ccc(cc1)S(=O)(=O)C1(CCN(Cc2ccc(cc2)-c2cccs2)CC1)C(=O)NO