Reaction Details
TargetInterstitial collagenase
LigandBDBM50128648
Substrate/Competitorn/a
Meas. Tech.ChEMBL_106291 (CHEMBL714547)
IC50 801±n/a nM
Citation Aranapakam, VDavis, JMGrosu, GTBaker, JEllingboe, JZask, ALevin, JISandanayaka, VPDu, MSkotnicki, JSDiJoseph, JFSung, ASharr, MAKillar, LMWalter, TJin, GCowling, RTillett, JZhao, WMcDevitt, JXu, ZB Synthesis and structure-activity relationship of N-substituted 4-arylsulfonylpiperidine-4-hydroxamic acids as novel, orally active matrix metalloproteinase inhibitors for the treatment of osteoarthritis. J Med Chem46:2376-96 (2003) 
 
Interstitial collagenase
Name:Interstitial collagenase
Type:Enzyme
Mol. Mass.:54010.26
Organism:Homo sapiens (Human)
Description: P03956
Residue:469
BDBM50128648
NameBDBM50128648
Synonyms:1-Benzyl-4-[4-(4-chloro-phenoxy)-benzenesulfonyl]-piperidine-4-carboxylic acid hydroxyamide CHEMBL79433
TypeSmall organic molecule
Emp. Form.C25H25ClN2O5S
Mol. Mass.500.994
SMILESONC(=O)C1(CCN(Cc2ccccc2)CC1)S(=O)(=O)c1ccc(Oc2ccc(Cl)cc2)cc1