Reaction Details
TargetCollagenase 3
LigandBDBM50128656
Substrate/Competitorn/a
Meas. Tech.ChEMBL_106632 (CHEMBL717016)
IC50 2±n/a nM
Citation Aranapakam, VDavis, JMGrosu, GTBaker, JEllingboe, JZask, ALevin, JISandanayaka, VPDu, MSkotnicki, JSDiJoseph, JFSung, ASharr, MAKillar, LMWalter, TJin, GCowling, RTillett, JZhao, WMcDevitt, JXu, ZB Synthesis and structure-activity relationship of N-substituted 4-arylsulfonylpiperidine-4-hydroxamic acids as novel, orally active matrix metalloproteinase inhibitors for the treatment of osteoarthritis. J Med Chem46:2376-96 (2003) 
 
Collagenase 3
Name:Collagenase 3
Type:Enzyme
Mol. Mass.:53808.06
Organism:Homo sapiens (Human)
Description:P45452
Residue:471
BDBM50128656
NameBDBM50128656
Synonyms:4-(4-(4-chlorophenoxy)phenylsulfonyl)-N-hydroxypiperidine-4-carboxamide CHEMBL80732
TypeSmall organic molecule
Emp. Form.C18H19ClN2O5S
Mol. Mass.410.872
SMILESONC(=O)C1(CCNCC1)S(=O)(=O)c1ccc(Oc2ccc(Cl)cc2)cc1