Reaction Details
TargetDisintegrin and metalloproteinase domain-containing protein 17
LigandBDBM50128640
Substrate/Competitorn/a
Meas. Tech.ChEMBL_212594 (CHEMBL812727)
IC50 506±n/a nM
Citation Aranapakam, VDavis, JMGrosu, GTBaker, JEllingboe, JZask, ALevin, JISandanayaka, VPDu, MSkotnicki, JSDiJoseph, JFSung, ASharr, MAKillar, LMWalter, TJin, GCowling, RTillett, JZhao, WMcDevitt, JXu, ZB Synthesis and structure-activity relationship of N-substituted 4-arylsulfonylpiperidine-4-hydroxamic acids as novel, orally active matrix metalloproteinase inhibitors for the treatment of osteoarthritis. J Med Chem46:2376-96 (2003) 
 
Disintegrin and metalloproteinase domain-containing protein 17
Name:Disintegrin and metalloproteinase domain-containing protein 17
Type:Enzyme
Mol. Mass.:93007.89
Organism:Homo sapiens (Human)
Description:
Residue:824
BDBM50128640
NameBDBM50128640
Synonyms:4-(4-Butoxy-benzenesulfonyl)-1-[3-(2-morpholin-4-yl-ethoxy)-benzyl]-piperidine-4-carboxylic acid hydroxyamide | CHEMBL80911
TypeSmall organic molecule
Emp. Form.C29H41N3O7S
Mol. Mass.575.717
SMILESCCCCOc1ccc(cc1)S(=O)(=O)C1(CCN(Cc2cccc(OCCN3CCOCC3)c2)CC1)C(=O)NO