Reaction Details
TargetCollagenase 3
LigandBDBM50128640
Substrate/Competitorn/a
Meas. Tech.ChEMBL_106632 (CHEMBL717016)
IC50 2±n/a nM
Citation Aranapakam, VDavis, JMGrosu, GTBaker, JEllingboe, JZask, ALevin, JISandanayaka, VPDu, MSkotnicki, JSDiJoseph, JFSung, ASharr, MAKillar, LMWalter, TJin, GCowling, RTillett, JZhao, WMcDevitt, JXu, ZB Synthesis and structure-activity relationship of N-substituted 4-arylsulfonylpiperidine-4-hydroxamic acids as novel, orally active matrix metalloproteinase inhibitors for the treatment of osteoarthritis. J Med Chem46:2376-96 (2003) 
 
Collagenase 3
Name:Collagenase 3
Type:Enzyme
Mol. Mass.:53808.06
Organism:Homo sapiens (Human)
Description:P45452
Residue:471
BDBM50128640
NameBDBM50128640
Synonyms:4-(4-Butoxy-benzenesulfonyl)-1-[3-(2-morpholin-4-yl-ethoxy)-benzyl]-piperidine-4-carboxylic acid hydroxyamide | CHEMBL80911
TypeSmall organic molecule
Emp. Form.C29H41N3O7S
Mol. Mass.575.717
SMILESCCCCOc1ccc(cc1)S(=O)(=O)C1(CCN(Cc2cccc(OCCN3CCOCC3)c2)CC1)C(=O)NO