Reaction Details
TargetMatrix metalloproteinase-9
LigandBDBM50128666
Substrate/Competitorn/a
Meas. Tech.ChEMBL_105516 (CHEMBL715225)
IC50 28±n/a nM
Citation Aranapakam, VDavis, JMGrosu, GTBaker, JEllingboe, JZask, ALevin, JISandanayaka, VPDu, MSkotnicki, JSDiJoseph, JFSung, ASharr, MAKillar, LMWalter, TJin, GCowling, RTillett, JZhao, WMcDevitt, JXu, ZB Synthesis and structure-activity relationship of N-substituted 4-arylsulfonylpiperidine-4-hydroxamic acids as novel, orally active matrix metalloproteinase inhibitors for the treatment of osteoarthritis. J Med Chem46:2376-96 (2003) 
 
Matrix metalloproteinase-9
Name:Matrix metalloproteinase-9
Type:Enzyme
Mol. Mass.:78452.28
Organism:Homo sapiens (Human)
Description:P14780
Residue:707
BDBM50128666
NameBDBM50128666
Synonyms:4-(4-Butoxy-benzenesulfonyl)-1-butyl-piperidine-4-carboxylic acid hydroxyamide CHEMBL420023
TypeSmall organic molecule
Emp. Form.C20H32N2O5S
Mol. Mass.412.543
SMILESCCCCOc1ccc(cc1)S(=O)(=O)C1(CCN(CCCC)CC1)C(=O)NO