Reaction Details
TargetDisintegrin and metalloproteinase domain-containing protein 17
LigandBDBM50128672
Substrate/Competitorn/a
Meas. Tech.ChEMBL_212594 (CHEMBL812727)
IC50 115±n/a nM
Citation Aranapakam, VDavis, JMGrosu, GTBaker, JEllingboe, JZask, ALevin, JISandanayaka, VPDu, MSkotnicki, JSDiJoseph, JFSung, ASharr, MAKillar, LMWalter, TJin, GCowling, RTillett, JZhao, WMcDevitt, JXu, ZB Synthesis and structure-activity relationship of N-substituted 4-arylsulfonylpiperidine-4-hydroxamic acids as novel, orally active matrix metalloproteinase inhibitors for the treatment of osteoarthritis. J Med Chem46:2376-96 (2003) 
 
Disintegrin and metalloproteinase domain-containing protein 17
Name:Disintegrin and metalloproteinase domain-containing protein 17
Type:Enzyme
Mol. Mass.:93007.89
Organism:Homo sapiens (Human)
Description:
Residue:824
BDBM50128672
NameBDBM50128672
Synonyms:1-(3,4-Dichloro-benzyl)-4-(4-methoxy-benzenesulfonyl)-piperidine-4-carboxylic acid hydroxyamide CHEMBL78962
TypeSmall organic molecule
Emp. Form.C20H22Cl2N2O5S
Mol. Mass.473.37
SMILESCOc1ccc(cc1)S(=O)(=O)C1(CCN(Cc2ccc(Cl)c(Cl)c2)CC1)C(=O)NO