Reaction Details
TargetInterstitial collagenase
LigandBDBM50128635
Substrate/Competitorn/a
Meas. Tech.ChEMBL_106291 (CHEMBL714547)
IC50 7060±n/a nM
Citation Aranapakam, VDavis, JMGrosu, GTBaker, JEllingboe, JZask, ALevin, JISandanayaka, VPDu, MSkotnicki, JSDiJoseph, JFSung, ASharr, MAKillar, LMWalter, TJin, GCowling, RTillett, JZhao, WMcDevitt, JXu, ZB Synthesis and structure-activity relationship of N-substituted 4-arylsulfonylpiperidine-4-hydroxamic acids as novel, orally active matrix metalloproteinase inhibitors for the treatment of osteoarthritis. J Med Chem46:2376-96 (2003) 
 
Interstitial collagenase
Name:Interstitial collagenase
Type:Enzyme
Mol. Mass.:54010.26
Organism:Homo sapiens (Human)
Description: P03956
Residue:469
BDBM50128635
NameBDBM50128635
Synonyms:4-(4-Butoxy-benzenesulfonyl)-1-ethyl-piperidine-4-carboxylic acid hydroxyamide CHEMBL79111
TypeSmall organic molecule
Emp. Form.C18H28N2O5S
Mol. Mass.384.49
SMILESCCCCOc1ccc(cc1)S(=O)(=O)C1(CCN(CC)CC1)C(=O)NO