Reaction Details
TargetMethionine aminopeptidase
LigandBDBM17847
Substrate/Competitorn/a
Meas. Tech.ChEMBL_105132 (CHEMBL872687)
IC50 180±n/a nM
Citation Luo, QLLi, JYLiu, ZYChen, LLLi, JQian, ZShen, QLi, YLushington, GHYe, QZNan, FJ Discovery and structural modification of inhibitors of methionine aminopeptidases from Escherichia coli and Saccharomyces cerevisiae. J Med Chem46:2631-40 (2003) 
 
Methionine aminopeptidase
Name:Methionine aminopeptidase
Type:Enzyme
Mol. Mass.:29326.96
Organism:Escherichia coli (strain K12)
Description:Full-length untagged EcMAP was expressed in E. coli.
Residue:264
BDBM17847
NameBDBM17847
Synonyms:CHEMBL327579 tert-butyl N-[2-(1,3-thiazol-2-ylcarbamoyl)pyridin-3-yl]carbamate
TypeSmall organic molecule
Emp. Form.C14H16N4O3S
Mol. Mass.320.367
SMILESCC(C)(C)OC(=O)Nc1cccnc1C(=O)Nc1nccs1