Reaction Details
TargetMethionine aminopeptidase 1
LigandBDBM17847
Substrate/Competitorn/a
Meas. Tech.ChEMBL_105134 (CHEMBL715018)
IC50 3350±n/a nM
Citation Luo, QLLi, JYLiu, ZYChen, LLLi, JQian, ZShen, QLi, YLushington, GHYe, QZNan, FJ Discovery and structural modification of inhibitors of methionine aminopeptidases from Escherichia coli and Saccharomyces cerevisiae. J Med Chem46:2631-40 (2003) 
 
Methionine aminopeptidase 1
Name:Methionine aminopeptidase 1
Type:PROTEIN
Mol. Mass.:43382.92
Organism:Saccharomyces cerevisiae
Description:ChEMBL_10701
Residue:387
BDBM17847
NameBDBM17847
Synonyms:CHEMBL327579 tert-butyl N-[2-(1,3-thiazol-2-ylcarbamoyl)pyridin-3-yl]carbamate
TypeSmall organic molecule
Emp. Form.C14H16N4O3S
Mol. Mass.320.367
SMILESCC(C)(C)OC(=O)Nc1cccnc1C(=O)Nc1nccs1