Reaction Details
TargetMethionine aminopeptidase 1
LigandBDBM50129656
Substrate/Competitorn/a
Meas. Tech.ChEMBL_105134 (CHEMBL715018)
IC50 620±n/a nM
Citation Luo, QLLi, JYLiu, ZYChen, LLLi, JQian, ZShen, QLi, YLushington, GHYe, QZNan, FJ Discovery and structural modification of inhibitors of methionine aminopeptidases from Escherichia coli and Saccharomyces cerevisiae. J Med Chem46:2631-40 (2003) 
 
Methionine aminopeptidase 1
Name:Methionine aminopeptidase 1
Type:PROTEIN
Mol. Mass.:43382.92
Organism:Saccharomyces cerevisiae
Description:ChEMBL_10701
Residue:387
BDBM50129656
NameBDBM50129656
Synonyms:3-Hexanoylamino-pyridine-2-carboxylic acid thiazol-2-ylamide | CHEMBL313650
TypeSmall organic molecule
Emp. Form.C15H18N4O2S
Mol. Mass.318.394
SMILESCCCCCC(=O)Nc1cccnc1C(=O)Nc1nccs1