Reaction Details
TargetCytosol aminopeptidase
LigandBDBM50129680
Substrate/Competitorn/a
Meas. Tech.ChEMBL_98401 (CHEMBL881814)
Ki 4880±n/a nM
Citation Grembecka, JMucha, ACierpicki, TKafarski, P The most potent organophosphorus inhibitors of leucine aminopeptidase. Structure-based design, chemistry, and activity. J Med Chem46:2641-55 (2003) 
 
Cytosol aminopeptidase
Name:Cytosol aminopeptidase
Type:PROTEIN
Mol. Mass.:56171.75
Organism:Homo sapiens (Human)
Description:ChEMBL_1507539
Residue:519
BDBM50129680
NameBDBM50129680
Synonyms:CHEMBL423870 | {[hydroxy(1-hydroxy-3-methylbutyl)phosphoryl]amino}acetic acid; dilithium salt
TypeSmall organic molecule
Emp. Form.C7H14NO5P
Mol. Mass.223.1646
SMILESCC(C)CC(O)P([O-])(=O)NCC([O-])=O