Reaction Details
TargetAminopeptidase N
LigandBDBM50129683
Substrate/Competitorn/a
Meas. Tech.ChEMBL_35503 (CHEMBL646413)
Ki 1015±n/a nM
Citation Grembecka, JMucha, ACierpicki, TKafarski, P The most potent organophosphorus inhibitors of leucine aminopeptidase. Structure-based design, chemistry, and activity. J Med Chem46:2641-55 (2003) 
 
Aminopeptidase N
Name:Aminopeptidase N
Type:Protein
Mol. Mass.:108810.25
Organism:Sus scrofa (Pig)
Description:P15145
Residue:963
BDBM50129683
NameBDBM50129683
Synonyms:2-[(1-Amino-3-methyl-butyl)-hydroxy-phosphinoylmethyl]-4-methyl-pentanoic acid CHEMBL328319 | Diastereomer-2-[(1-Amino-3-methyl-butyl)-hydroxy-phosphinoylmethyl]-4-methyl-pentanoic acid
TypeSmall organic molecule
Emp. Form.C12H26NO4P
Mol. Mass.279.3129
SMILESCC(C)CC(CP(O)(O)C(=N)CC(C)C)C(O)=O