Reaction Details
TargetCytosol aminopeptidase
LigandBDBM23971
Substrate/Competitorn/a
Meas. Tech.ChEMBL_98401 (CHEMBL881814)
Ki 0.6±n/a nM
Citation Grembecka, JMucha, ACierpicki, TKafarski, P The most potent organophosphorus inhibitors of leucine aminopeptidase. Structure-based design, chemistry, and activity. J Med Chem46:2641-55 (2003) 
 
Cytosol aminopeptidase
Name:Cytosol aminopeptidase
Type:PROTEIN
Mol. Mass.:56171.75
Organism:Homo sapiens (Human)
Description:ChEMBL_1507539
Residue:519
BDBM23971
NameBDBM23971
Synonyms:(2S)-2-[(2S,3R)-3-amino-2-hydroxy-4-phenylbutanamido]-4-methylpentanoic acid CHEMBL29292 | Ubenimex
TypeSmall organic molecule
Emp. Form.C16H24N2O4
Mol. Mass.308.3728
SMILESCC(C)C[C@H](NC(=O)[C@@H](O)[C@H](N)Cc1ccccc1)C(O)=O