Reaction Details
TargetAminopeptidase N
LigandBDBM50129682
Substrate/Competitorn/a
Meas. Tech.ChEMBL_35503 (CHEMBL646413)
Ki 1006±n/a nM
Citation Grembecka, JMucha, ACierpicki, TKafarski, P The most potent organophosphorus inhibitors of leucine aminopeptidase. Structure-based design, chemistry, and activity. J Med Chem46:2641-55 (2003) 
 
Aminopeptidase N
Name:Aminopeptidase N
Type:Protein
Mol. Mass.:108810.25
Organism:Sus scrofa (Pig)
Description:P15145
Residue:963
BDBM50129682
NameBDBM50129682
Synonyms:2-[(1-Amino-3-phenyl-propyl)-hydroxy-phosphinoylmethyl]-4-methyl-pentanoic acid | CHEMBL327182
TypeSmall organic molecule
Emp. Form.C16H26NO4P
Mol. Mass.327.3557
SMILESCC(C)CC(CP(O)(O)C(=N)CCc1ccccc1)C(O)=O