Reaction Details
TargetProtein kinase C alpha type
LigandBDBM50107120
Substrate/Competitorn/a
Meas. Tech.ChEMBL_160294 (CHEMBL769622)
Ki 4.5±n/a nM
Citation Choi, YKang, JHLewin, NEBlumberg, PMLee, JMarquez, VE Conformationally constrained analogues of diacylglycerol. 19. Synthesis and protein kinase C binding affinity of diacylglycerol lactones bearing an N-hydroxylamide side chain. J Med Chem46:2790-3 (2003) 
 
Protein kinase C alpha type
Name:Protein kinase C alpha type
Type:Enzyme
Mol. Mass.:76755.65
Organism:Homo sapiens (Human)
Description:The recombinant human PKC enzymes were produced using a baculovirus expression system in SF9 cells
Residue:672
BDBM50107120
NameBDBM50107120
Synonyms:(E) 2,2-Dimethyl-propionic acid 2-hydroxymethyl-4-(3-isobutyl-5-methyl-hexylidene)-5-oxo-tetrahydro-furan-2-ylmethyl ester 2,2-Dimethyl-propionic acid 2-hydroxymethyl-4-(3-isobutyl-5-methyl-hexylidene)-5-oxo-tetrahydro-furan-2-ylmethyl ester CHEMBL137386
TypeSmall organic molecule
Emp. Form.C22H38O5
Mol. Mass.382.5341
SMILESCC(C)CC(C\C=C1/CC(CO)(COC(=O)C(C)(C)C)OC1=O)CC(C)C