Reaction Details
Target5-hydroxytryptamine receptor 5A
LigandBDBM78940
Substrate/Competitorn/a
Meas. Tech.ChEMBL_3581 (CHEMBL620714)
Ki 1±n/a nM
Citation Glennon, RA Higher-end serotonin receptors: 5-HT(5), 5-HT(6), and 5-HT(7). J Med Chem46:2795-812 (2003) 
 
5-hydroxytryptamine receptor 5A
Name:5-hydroxytryptamine receptor 5A
Type:Enzyme
Mol. Mass.:40266.25
Organism:Homo sapiens (Human)
Description:P47898
Residue:357
BDBM78940
NameBDBM78940
Synonyms:METHIOTHEPIN Methiothepin mesylate salt cid_3039995 methanesulfonic acid;1-methyl-4-(3-methylsulfanyl-5,6-dihydrobenzo[b][1]benzothiepin-5-yl)piperazine | methanesulfonic acid;1-methyl-4-[3-(methylthio)-5,6-dihydrobenzo[b][1]benzothiepin-5-yl]piperazine
TypeSmall organic molecule
Emp. Form.C20H24N2S2
Mol. Mass.356.548
SMILESCSc1ccc2Sc3ccccc3CC(N3CCN(C)CC3)c2c1