Reaction Details
Target5-hydroxytryptamine receptor 1A
LigandBDBM50052869
Substrate/Competitorn/a
Meas. Tech.ChEMBL_1544 (CHEMBL872906)
Ki 1.8±n/a nM
Citation Glennon, RA Higher-end serotonin receptors: 5-HT(5), 5-HT(6), and 5-HT(7). J Med Chem46:2795-812 (2003) 
 
5-hydroxytryptamine receptor 1A
Name:5-hydroxytryptamine receptor 1A
Type:n/a
Mol. Mass.:46122.49
Organism:Homo sapiens (Human)
Description:n/a
Residue:422
BDBM50052869
NameBDBM50052869
Synonyms:(R)-6-Methyl-11-phenyl-5,6,6a,7-tetrahydro-4H-dibenzo[de,g]quinoline CHEMBL25924
TypeSmall organic molecule
Emp. Form.C23H21N
Mol. Mass.311.4195
SMILESCN1CCc2cccc-3c2[C@H]1Cc1cccc(-c2ccccc2)c-31