Reaction Details
Target5-hydroxytryptamine receptor 6
LigandBDBM50106250
Substrate/Competitorn/a
Meas. Tech.ChEMBL_3664 (CHEMBL620800)
Ki 4.1±n/a nM
Citation Glennon, RA Higher-end serotonin receptors: 5-HT(5), 5-HT(6), and 5-HT(7). J Med Chem46:2795-812 (2003) 
 
5-hydroxytryptamine receptor 6
Name:5-hydroxytryptamine receptor 6
Type:G Protein-Coupled Receptor (GPCR)
Mol. Mass.:46968.43
Organism:Homo sapiens (Human)
Description:P50406
Residue:440
BDBM50106250
NameBDBM50106250
Synonyms:CHEMBL93868 [2-(1-Benzenesulfonyl-1H-indol-3-yl)-ethyl]-dimethyl-amine
TypeSmall organic molecule
Emp. Form.C18H20N2O2S
Mol. Mass.328.429
SMILESCN(C)CCc1cn(c2ccccc12)S(=O)(=O)c1ccccc1