Reaction Details
Target5-hydroxytryptamine receptor 6
LigandBDBM50130274
Substrate/Competitorn/a
Meas. Tech.ChEMBL_3664 (CHEMBL620800)
Ki 1.5±n/a nM
Citation Glennon, RA Higher-end serotonin receptors: 5-HT(5), 5-HT(6), and 5-HT(7). J Med Chem46:2795-812 (2003) 
 
5-hydroxytryptamine receptor 6
Name:5-hydroxytryptamine receptor 6
Type:G Protein-Coupled Receptor (GPCR)
Mol. Mass.:46968.43
Organism:Homo sapiens (Human)
Description:P50406
Residue:440
BDBM50130274
NameBDBM50130274
Synonyms:(9-Benzenesulfonyl-6-methoxy-2,3,4,9-tetrahydro-1H-carbazol-4-ylmethyl)-dimethyl-amine | CHEMBL92093
TypeSmall organic molecule
Emp. Form.C22H26N2O3S
Mol. Mass.398.518
SMILESCOc1ccc2n(c3CCCC(CN(C)C)c3c2c1)S(=O)(=O)c1ccccc1