Reaction Details
Target5-hydroxytryptamine receptor 6
LigandBDBM50093055
Substrate/Competitorn/a
Meas. Tech.ChEMBL_3664 (CHEMBL620800)
Ki 0.900000±n/a nM
Citation Glennon, RA Higher-end serotonin receptors: 5-HT(5), 5-HT(6), and 5-HT(7). J Med Chem46:2795-812 (2003) 
 
5-hydroxytryptamine receptor 6
Name:5-hydroxytryptamine receptor 6
Type:G Protein-Coupled Receptor (GPCR)
Mol. Mass.:46968.43
Organism:Homo sapiens (Human)
Description:P50406
Residue:440
BDBM50093055
NameBDBM50093055
Synonyms:CHEMBL443796 | {2-[5-Methoxy-1-(naphthalene-1-sulfonyl)-1H-indol-3-yl]-ethyl}-dimethyl-amine
TypeSmall organic molecule
Emp. Form.C23H24N2O3S
Mol. Mass.408.513
SMILESCOc1ccc2n(cc(CCN(C)C)c2c1)S(=O)(=O)c1cccc2ccccc12