Reaction Details
Target5-hydroxytryptamine receptor 7
LigandBDBM50116967
Substrate/Competitorn/a
Meas. Tech.ChEMBL_3778 (CHEMBL619854)
Ki 3±n/a nM
Citation Glennon, RA Higher-end serotonin receptors: 5-HT(5), 5-HT(6), and 5-HT(7). J Med Chem46:2795-812 (2003) 
 
5-hydroxytryptamine receptor 7
Name:5-hydroxytryptamine receptor 7
Type:G Protein-Coupled Receptor (GPCR)
Mol. Mass.:53573.08
Organism:Homo sapiens (Human)
Description:P34969
Residue:479
BDBM50116967
NameBDBM50116967
Synonyms:2-[2-(6-Bromo-indol-1-yl)-ethyl]-decahydro-pyrido[1,2-a][1,4]diazepine | CHEMBL309750
TypeSmall organic molecule
Emp. Form.C19H26BrN3
Mol. Mass.376.334
SMILESBrc1ccc2ccn(CCN3CCCN4CCCCC4C3)c2c1