Reaction Details
TargetAlpha-1B adrenergic receptor
LigandBDBM50030614
Substrate/Competitorn/a
Meas. Tech.ChEMBL_34333 (CHEMBL648993)
Ki 23±n/a nM
Citation Romeo, GMateria, LManetti, FCagnotto, AMennini, TNicoletti, FBotta, MRusso, FMinneman, KP New pyrimido[5,4-b]indoles as ligands for alpha(1)-adrenoceptor subtypes. J Med Chem46:2877-94 (2003) 
 
Alpha-1B adrenergic receptor
Name:Alpha-1B adrenergic receptor
Type:Enzyme
Mol. Mass.:56862.13
Organism:Homo sapiens (Human)
Description:P35368
Residue:520
BDBM50030614
NameBDBM50030614
Synonyms:5-Chloro-8-methyl-1-vinyl-6,7,8,9-tetrahydro-2-thia-8-aza-benzo[cd]azulene SK&F-104856 SKF 104856
TypeSmall organic molecule
Emp. Form.C14H14ClNS
Mol. Mass.263.786
SMILESCN1CCc2c(Cl)ccc3sc(C=C)c(C1)c23