Reaction Details
TargetGeranylgeranyl transferase type-1 subunit beta/Protein farnesyltransferase/geranylgeranyltransferase type-1 subunit alpha
LigandBDBM50130365
Substrate/Competitorn/a
Meas. Tech.ChEMBL_165974 (CHEMBL774952)
EC50 47±n/a nM
Citation deSolms, SJCiccarone, TMMacTough, SCShaw, AWBuser, CAEllis-Hutchings, MFernandes, CHamilton, KAHuber, HEKohl, NELobell, RBRobinson, RGTsou, NNWalsh, ESGraham, SLBeese, LSTaylor, JS Dual protein farnesyltransferase-geranylgeranyltransferase-I inhibitors as potential cancer chemotherapeutic agents. J Med Chem46:2973-84 (2003) 
 
Geranylgeranyl transferase type-1 subunit beta/Protein farnesyltransferase/geranylgeranyltransferase type-1 subunit alpha
Name:Geranylgeranyl transferase type-1 subunit beta/Protein farnesyltransferase/geranylgeranyltransferase type-1 subunit alpha
Type:n/a
Mol. Mass.:n/a
Description:ASSAY_ID of EBI is 70196
Components:This complex has 2 components.
Component 1
Name:Protein farnesyltransferase/geranylgeranyltransferase type-1 subunit alpha
Synonyms:CAAX farnesyltransferase alpha subunit FNTA_HUMAN FTase-alpha Geranylgeranyl Transferase (GGTase-I) Chain A Protein Farnesyltransferase (PFT) Chain A Protein farnesyltransferase Protein farnesyltransferase/geranylgeranyltransferase type I alpha subunit | Ras proteins prenyltransferase alpha
Type:Enzyme
Mol. Mass.:44392.46
Organism:Homo sapiens (Human)
Description:Recombinant human FTase.
Residue:379
Component 2
Name:Geranylgeranyl transferase type-1 subunit beta
Synonyms:2.5.1.59 Geranylgeranyl transferase type I Geranylgeranyl transferase type I subunit beta PGGT1B Protein farnesyl/geranylgeranyl transferase | Type I protein geranyl-geranyltransferase subunit beta
Type:n/a
Mol. Mass.:42369.84
Organism:Homo sapiens (Human)
Description:n/a
Residue:377
BDBM50130365
NameBDBM50130365
Synonyms:4-[1-Amino-1-(3-methyl-3H-imidazol-4-yl)-ethyl]-2-{3-[1-methyl-2-oxo-3-(3,3,3-trifluoro-propyl)-azepan-3-yl]-phenoxy}-benzonitrile | CHEMBL316673
TypeSmall organic molecule
Emp. Form.C29H32F3N5O2
Mol. Mass.539.5919
SMILESCN1CCCC[C@@](CCC(F)(F)F)(c2cccc(Oc3cc(ccc3C#N)[C@](C)(N)c3cncn3C)c2)C1=O