Reaction Details
TargetMu-type opioid receptor
LigandBDBM50027038
Substrate/Competitorn/a
Meas. Tech.ChEMBL_148223 (CHEMBL754713)
Ki 13±n/a nM
Citation Thomas, JBAtkinson, RNVinson, NACatanzaro, JLPerretta, CLFix, SEMascarella, SWRothman, RBXu, HDersch, CMCantrell, BEZimmerman, DMCarroll, FI Identification of (3R)-7-hydroxy-N-((1S)-1-[[(3R,4R)-4-(3-hydroxyphenyl)- 3,4-dimethyl-1-piperidinyl]methyl]-2-methylpropyl)-1,2,3,4-tetrahydro- 3-isoquinolinecarboxamide as a novel potent and selective opioid kappa receptor antagonist. J Med Chem46:3127-37 (2003) 
 
Mu-type opioid receptor
Name:Mu-type opioid receptor
Type:G Protein-Coupled Receptor (GPCR)
Mol. Mass.:44789.51
Organism:Homo sapiens (Human)
Description:P35372
Residue:400
BDBM50027038
NameBDBM50027038
Synonyms:CHEMBL2112474
TypeSmall organic molecule
Emp. Form.C32H46N4O4
Mol. Mass.550.732
SMILESCC(C)[C@@H](CN1CC[C@](C)([C@@H](C)C1)c1cccc(O)c1)NC(=O)[C@H]1Cc2ccc(O)cc2CN1C(=O)CN(C)C