Reaction Details
TargetDelta-type opioid receptor
LigandBDBM50130561
Substrate/Competitorn/a
Meas. Tech.ChEMBL_147030 (CHEMBL753671)
Ki>4900±n/a nM
Citation Thomas, JBAtkinson, RNVinson, NACatanzaro, JLPerretta, CLFix, SEMascarella, SWRothman, RBXu, HDersch, CMCantrell, BEZimmerman, DMCarroll, FI Identification of (3R)-7-hydroxy-N-((1S)-1-[[(3R,4R)-4-(3-hydroxyphenyl)- 3,4-dimethyl-1-piperidinyl]methyl]-2-methylpropyl)-1,2,3,4-tetrahydro- 3-isoquinolinecarboxamide as a novel potent and selective opioid kappa receptor antagonist. J Med Chem46:3127-37 (2003) 
 
Delta-type opioid receptor
Name:Delta-type opioid receptor
Type:G Protein-Coupled Receptor (GPCR)
Mol. Mass.:40465.04
Organism:Rattus norvegicus (rat)
Description:Competition binding assays were using CHO-K1 cell membranes expressing the opioid receptor.
Residue:372
BDBM50130561
NameBDBM50130561
Synonyms:(R)-N-((S)-1-((3R,4R)-4-(3-hydroxyphenyl)-3,4-dimethylpiperidin-1-yl)-3-methylbutan-2-yl)-1,2,3,4-tetrahydroisoquinoline-3-carboxamide 1,2,3,4-Tetrahydro-isoquinoline-3-carboxylic acid {1-[4-(3-hydroxy-phenyl)-3,4-dimethyl-piperidin-1-ylmethyl]-2-methyl-propyl}-amide | CHEMBL10872
TypeSmall organic molecule
Emp. Form.C28H39N3O2
Mol. Mass.449.6282
SMILESCC(C)[C@@H](CN1CC[C@](C)([C@@H](C)C1)c1cccc(O)c1)NC(=O)[C@H]1Cc2ccccc2CN1