Reaction Details
TargetDelta-type opioid receptor
LigandBDBM50102710
Substrate/Competitorn/a
Meas. Tech.ChEMBL_147030 (CHEMBL753671)
Ki>3400±n/a nM
Citation Thomas, JBAtkinson, RNVinson, NACatanzaro, JLPerretta, CLFix, SEMascarella, SWRothman, RBXu, HDersch, CMCantrell, BEZimmerman, DMCarroll, FI Identification of (3R)-7-hydroxy-N-((1S)-1-[[(3R,4R)-4-(3-hydroxyphenyl)- 3,4-dimethyl-1-piperidinyl]methyl]-2-methylpropyl)-1,2,3,4-tetrahydro- 3-isoquinolinecarboxamide as a novel potent and selective opioid kappa receptor antagonist. J Med Chem46:3127-37 (2003) 
 
Delta-type opioid receptor
Name:Delta-type opioid receptor
Type:G Protein-Coupled Receptor (GPCR)
Mol. Mass.:40465.04
Organism:Rattus norvegicus (rat)
Description:Competition binding assays were using CHO-K1 cell membranes expressing the opioid receptor.
Residue:372
BDBM50102710
NameBDBM50102710
Synonyms:3-(4-Hydroxy-phenyl)-N-{(S)-1-[(3R,4R)-4-(3-hydroxy-phenyl)-3,4-dimethyl-piperidin-1-ylmethyl]-2-methyl-propyl}-propionamide CHEMBL10986
TypeSmall organic molecule
Emp. Form.C27H38N2O3
Mol. Mass.438.6022
SMILESCC(C)[C@@H](CN1CC[C@](C)([C@@H](C)C1)c1cccc(O)c1)NC(=O)CCc1ccc(O)cc1