Reaction Details
TargetDelta-type opioid receptor
LigandBDBM50130607
Substrate/Competitorn/a
Meas. Tech.ChEMBL_145311 (CHEMBL751917)
EC50 72±n/a nM
Citation Grundt, PMartinez-Bermejo, FLewis, JWHusbands, SM Opioid binding and in vitro profiles of a series of 4-hdroxy-3-methoxyindolomorphinans. Transformation of a delta-selective ligand into a high affinity kappa-selective ligand by introduction of a 5,14-substituted bridge. J Med Chem46:3174-7 (2003) 
 
Delta-type opioid receptor
Name:Delta-type opioid receptor
Type:G Protein-Coupled Receptor (GPCR)
Mol. Mass.:40382.98
Organism:Homo sapiens (Human)
Description:Competition binding assays were carried out using membrane preparations from transfected HN9.10 cells that constitutively expressed the delta opioid receptor.
Residue:372
BDBM50130607
NameBDBM50130607
Synonyms:3-hydroxy-4-methoxy-17-methyl-18-[1-phenyl-(E)-ethylidene]-17-azapentacyclo[7.5.3.210,14.01,10.02,7]nonadeca-2(7),3,5-trien-13-one | CHEMBL110124
TypeSmall organic molecule
Emp. Form.C28H31NO3
Mol. Mass.429.5506
SMILESCOc1ccc2CC3N(C)CC[C@@]4([C@@H]5\C(C[C@]34CCC5=O)=C(/C)c3ccccc3)c2c1O