Reaction Details
TargetMu-type opioid receptor
LigandBDBM60212
Substrate/Competitorn/a
Meas. Tech.ChEMBL_148099 (CHEMBL751581)
Ki 0.200000±n/a nM
Citation Grundt, PMartinez-Bermejo, FLewis, JWHusbands, SM Opioid binding and in vitro profiles of a series of 4-hdroxy-3-methoxyindolomorphinans. Transformation of a delta-selective ligand into a high affinity kappa-selective ligand by introduction of a 5,14-substituted bridge. J Med Chem46:3174-7 (2003) 
 
Mu-type opioid receptor
Name:Mu-type opioid receptor
Type:G Protein-Coupled Receptor (GPCR)
Mol. Mass.:44789.51
Organism:Homo sapiens (Human)
Description:P35372
Residue:400
BDBM60212
NameBDBM60212
Synonyms:(4R,4aS,7aR,12bS)-3-(cyclopropylmethyl)-4a,9-bis(oxidanyl)-2,4,5,6,7a,13-hexahydro-1H-4,12-methanobenzofuro[3,2-e]isoquinoline-7-one;hydrochloride MLS000069607 SMR000058767 US9107954, naltrexone | cid_5485201
TypeSmall organic molecule
Emp. Form.C20H23NO4
Mol. Mass.341.4009
SMILESOc1ccc2C[C@H]3N(CC4CC4)CC[C@@]45[C@@H](Oc1c24)C(=O)CC[C@@]35O