Reaction Details
TargetKappa-type opioid receptor
LigandBDBM50130600
Substrate/Competitorn/a
Meas. Tech.ChEMBL_145245 (CHEMBL755695)
Ki 0.610000±n/a nM
Citation Grundt, PMartinez-Bermejo, FLewis, JWHusbands, SM Opioid binding and in vitro profiles of a series of 4-hdroxy-3-methoxyindolomorphinans. Transformation of a delta-selective ligand into a high affinity kappa-selective ligand by introduction of a 5,14-substituted bridge. J Med Chem46:3174-7 (2003) 
 
Kappa-type opioid receptor
Name:Kappa-type opioid receptor
Type:G Protein-Coupled Receptor (GPCR)
Mol. Mass.:42648.76
Organism:Homo sapiens (Human)
Description:P41145
Residue:380
BDBM50130600
NameBDBM50130600
Synonyms:19-methoxy-24-methyl-26-[1-phenyl-(E)-ethylidene]-4,24-diazaheptacyclo[12.7.3.22,13.01,13.03,11.05,10.016,21]hexacosa-3(11),5(10),6,8,16(21),17,19-heptaen-20-ol | CHEMBL107420
TypeSmall organic molecule
Emp. Form.C34H34N2O2
Mol. Mass.502.646
SMILESCOc1ccc2CC3N(C)CC[C@@]4([C@@H]5\C(C[C@]34Cc3c5[nH]c4ccccc34)=C(/C)c3ccccc3)c2c1O