Reaction Details
TargetMu-type opioid receptor
LigandBDBM50130605
Substrate/Competitorn/a
Meas. Tech.ChEMBL_145585 (CHEMBL749730)
EC50 1201±n/a nM
Citation Grundt, PMartinez-Bermejo, FLewis, JWHusbands, SM Opioid binding and in vitro profiles of a series of 4-hdroxy-3-methoxyindolomorphinans. Transformation of a delta-selective ligand into a high affinity kappa-selective ligand by introduction of a 5,14-substituted bridge. J Med Chem46:3174-7 (2003) 
 
Mu-type opioid receptor
Name:Mu-type opioid receptor
Type:G Protein-Coupled Receptor (GPCR)
Mol. Mass.:44789.51
Organism:Homo sapiens (Human)
Description:P35372
Residue:400
BDBM50130605
NameBDBM50130605
Synonyms:13,22-dimethyl-2-(3-methyl-2-butenyl)-14-oxa-11,22-diazaheptacyclo[13.9.1.01,13.02,21.04,12.05,10.019,25]pentacosa-4(12),5(10),6,8,15,17,19(25)-heptaen-16-ol | CHEMBL322875
TypeSmall organic molecule
Emp. Form.C29H32N2O2
Mol. Mass.440.5766
SMILESCN1CC[C@]23c4c5O[C@@]2(C)c2[nH]c6ccccc6c2C[C@@]3(CC=C(C)C)C1Cc4ccc5O