Reaction Details
TargetMu-type opioid receptor
LigandBDBM50130601
Substrate/Competitorn/a
Meas. Tech.ChEMBL_145585 (CHEMBL749730)
EC50 1644±n/a nM
Citation Grundt, PMartinez-Bermejo, FLewis, JWHusbands, SM Opioid binding and in vitro profiles of a series of 4-hdroxy-3-methoxyindolomorphinans. Transformation of a delta-selective ligand into a high affinity kappa-selective ligand by introduction of a 5,14-substituted bridge. J Med Chem46:3174-7 (2003) 
 
Mu-type opioid receptor
Name:Mu-type opioid receptor
Type:G Protein-Coupled Receptor (GPCR)
Mol. Mass.:44789.51
Organism:Homo sapiens (Human)
Description:P35372
Residue:400
BDBM50130601
NameBDBM50130601
Synonyms:26-[(E)-ethylidene]-19-methoxy-24-methyl-4,24-diazaheptacyclo[12.7.3.22,13.01,13.03,11.05,10.016,21]hexacosa-3(11),5(10),6,8,16(21),17,19-heptaen-20-ol | CHEMBL320306
TypeSmall organic molecule
Emp. Form.C28H30N2O2
Mol. Mass.426.55
SMILESCOc1ccc2CC3N(C)CC[C@@]4([C@@H]5\C(C[C@]34Cc3c5[nH]c4ccccc34)=C\C)c2c1O