Reaction Details
TargetLanosterol synthase
LigandBDBM50130787
Substrate/Competitorn/a
Meas. Tech.ChEMBL_80 (CHEMBL615201)
IC50 8.70±n/a nM
Citation Dehmlow, HAebi, JDJolidon, SJi, YHvon der Mark, EMHimber, JMorand, OH Synthesis and structure-activity studies of novel orally active non-terpenoic 2,3-oxidosqualene cyclase inhibitors. J Med Chem46:3354-70 (2003) 
 
Lanosterol synthase
Name:Lanosterol synthase
Type:PROTEIN
Mol. Mass.:83309.32
Organism:Homo sapiens (Human)
Description:ChEMBL_11231
Residue:732
BDBM50130787
NameBDBM50130787
Synonyms:CHEMBL114266 {6-[6-(Allyl-methyl-amino)-hexyloxy]-pyridin-3-yl}-(4-bromo-phenyl)-methanone; fumarate
TypeSmall organic molecule
Emp. Form.C22H27BrN2O2
Mol. Mass.431.366
SMILESCN(CCCCCCOc1ccc(cn1)C(=O)c1ccc(Br)cc1)CC=C