Reaction Details
TargetLanosterol synthase
LigandBDBM50130786
Substrate/Competitorn/a
Meas. Tech.ChEMBL_80 (CHEMBL615201)
IC50 6.2±n/a nM
Citation Dehmlow, HAebi, JDJolidon, SJi, YHvon der Mark, EMHimber, JMorand, OH Synthesis and structure-activity studies of novel orally active non-terpenoic 2,3-oxidosqualene cyclase inhibitors. J Med Chem46:3354-70 (2003) 
 
Lanosterol synthase
Name:Lanosterol synthase
Type:PROTEIN
Mol. Mass.:83309.32
Organism:Homo sapiens (Human)
Description:ChEMBL_11231
Residue:732
BDBM50130786
NameBDBM50130786
Synonyms:CHEMBL115923 {4-[6-(Allyl-methyl-amino)-hexyloxy]-2-methylsulfanyl-phenyl}-(4-bromo-phenyl)-methanone; fumarate
TypeSmall organic molecule
Emp. Form.C24H30BrNO2S
Mol. Mass.476.47
SMILESCSc1cc(OCCCCCCN(C)CC=C)ccc1C(=O)c1ccc(Br)cc1