Reaction Details
TargetLanosterol synthase
LigandBDBM50130789
Substrate/Competitorn/a
Meas. Tech.ChEMBL_80 (CHEMBL615201)
IC50 5.6±n/a nM
Citation Dehmlow, HAebi, JDJolidon, SJi, YHvon der Mark, EMHimber, JMorand, OH Synthesis and structure-activity studies of novel orally active non-terpenoic 2,3-oxidosqualene cyclase inhibitors. J Med Chem46:3354-70 (2003) 
 
Lanosterol synthase
Name:Lanosterol synthase
Type:PROTEIN
Mol. Mass.:83309.32
Organism:Homo sapiens (Human)
Description:ChEMBL_11231
Residue:732
BDBM50130789
NameBDBM50130789
Synonyms:Allyl-{6-[3-(4-bromo-phenyl)-benzo[b]thiophen-6-yloxy]-hexyl}-methyl-amine; fumarate | CHEMBL116000
TypeSmall organic molecule
Emp. Form.C24H28BrNOS
Mol. Mass.458.454
SMILESCN(CCCCCCOc1ccc2c(csc2c1)-c1ccc(Br)cc1)CC=C