Reaction Details
TargetNH(3)-dependent NAD(+) synthetase
LigandBDBM50130799
Substrate/Competitorn/a
Meas. Tech.ChEMBL_141613 (CHEMBL747929)
IC50 24000±n/a nM
Citation Velu, SECristofoli, WAGarcia, GJBrouillette, CGPierson, MCLuan, CHDeLucas, LJBrouillette, WJ Tethered dimers as NAD synthetase inhibitors with antibacterial activity. J Med Chem46:3371-81 (2003) 
 
NH(3)-dependent NAD(+) synthetase
Name:NH(3)-dependent NAD(+) synthetase
Type:PROTEIN
Mol. Mass.:30386.77
Organism:Bacillus subtilis
Description:ChEMBL_141613
Residue:272
BDBM50130799
NameBDBM50130799
Synonyms:CHEMBL114967 | Trimethyl-{4-[9-(5-nitro-indol-1-yl)-nonyloxycarbonylmethyl]-phenyl}-ammonium; iodide
TypeSmall organic molecule
Emp. Form.C28H38N3O4
Mol. Mass.480.6185
SMILESC[N+](C)(C)c1ccc(CC(=O)OCCCCCCCCCn2ccc3cc(ccc23)[N+]([O-])=O)cc1