Reaction Details
TargetNH(3)-dependent NAD(+) synthetase
LigandBDBM50366389
Substrate/Competitorn/a
Meas. Tech.ChEMBL_141613 (CHEMBL747929)
IC50>1000±n/a nM
Citation Velu, SECristofoli, WAGarcia, GJBrouillette, CGPierson, MCLuan, CHDeLucas, LJBrouillette, WJ Tethered dimers as NAD synthetase inhibitors with antibacterial activity. J Med Chem46:3371-81 (2003) 
 
NH(3)-dependent NAD(+) synthetase
Name:NH(3)-dependent NAD(+) synthetase
Type:PROTEIN
Mol. Mass.:30386.77
Organism:Bacillus subtilis
Description:ChEMBL_141613
Residue:272
BDBM50366389
NameBDBM50366389
Synonyms:GENTAMICIN
TypeSmall organic molecule
Emp. Form.C21H43N5O7
Mol. Mass.477.5954
SMILESCN[C@H](C)[C@@H]1CC[C@@H](N)[C@@H](O[C@@H]2[C@@H](N)C[C@@H](N)[C@H](O[C@H]3OC[C@](C)(O)[C@H](NC)[C@H]3O)[C@H]2O)O1