Reaction Details
TargetNH(3)-dependent NAD(+) synthetase
LigandBDBM50130813
Substrate/Competitorn/a
Meas. Tech.ChEMBL_141613 (CHEMBL747929)
IC50>1000000±n/a nM
Citation Velu, SECristofoli, WAGarcia, GJBrouillette, CGPierson, MCLuan, CHDeLucas, LJBrouillette, WJ Tethered dimers as NAD synthetase inhibitors with antibacterial activity. J Med Chem46:3371-81 (2003) 
 
NH(3)-dependent NAD(+) synthetase
Name:NH(3)-dependent NAD(+) synthetase
Type:PROTEIN
Mol. Mass.:30386.77
Organism:Bacillus subtilis
Description:ChEMBL_141613
Residue:272
BDBM50130813
NameBDBM50130813
Synonyms:CHEMBL113846 | Nicotinic acid 6-(5-nitro-indol-1-yl)-hexyl ester
TypeSmall organic molecule
Emp. Form.C20H21N3O4
Mol. Mass.367.3984
SMILES[O-][N+](=O)c1ccc2n(CCCCCCOC(=O)c3cccnc3)ccc2c1