Reaction Details
TargetNH(3)-dependent NAD(+) synthetase
LigandBDBM50130826
Substrate/Competitorn/a
Meas. Tech.ChEMBL_141613 (CHEMBL747929)
IC50 60000±n/a nM
Citation Velu, SECristofoli, WAGarcia, GJBrouillette, CGPierson, MCLuan, CHDeLucas, LJBrouillette, WJ Tethered dimers as NAD synthetase inhibitors with antibacterial activity. J Med Chem46:3371-81 (2003) 
 
NH(3)-dependent NAD(+) synthetase
Name:NH(3)-dependent NAD(+) synthetase
Type:PROTEIN
Mol. Mass.:30386.77
Organism:Bacillus subtilis
Description:ChEMBL_141613
Residue:272
BDBM50130826
NameBDBM50130826
Synonyms:CHEMBL326763 | {4-[5-(5-Benzyloxy-indol-1-yl)-pentyloxycarbonylmethyl]-phenyl}-trimethyl-ammonium; iodide
TypeSmall organic molecule
Emp. Form.C31H37N2O3
Mol. Mass.485.6365
SMILESC[N+](C)(C)c1ccc(CC(=O)OCCCCCn2ccc3cc(OCc4ccccc4)ccc23)cc1