Reaction Details
TargetNH(3)-dependent NAD(+) synthetase
LigandBDBM92600
Substrate/Competitorn/a
Meas. Tech.ChEMBL_141613 (CHEMBL747929)
IC50 10000±n/a nM
Citation Velu, SECristofoli, WAGarcia, GJBrouillette, CGPierson, MCLuan, CHDeLucas, LJBrouillette, WJ Tethered dimers as NAD synthetase inhibitors with antibacterial activity. J Med Chem46:3371-81 (2003) 
 
NH(3)-dependent NAD(+) synthetase
Name:NH(3)-dependent NAD(+) synthetase
Type:PROTEIN
Mol. Mass.:30386.77
Organism:Bacillus subtilis
Description:ChEMBL_141613
Residue:272
BDBM92600
NameBDBM92600
Synonyms:CHEMBL419944 | NAD Synthetase Inhibitor, 5
TypeOrganic molecule
Emp. Form.C30H41N2O4
Mol. Mass.493.657
SMILESCOC(=O)c1cc2ccccc2n1CCCCCCCCCOC(=O)Cc1ccc(cc1)[N+](C)(C)C