Reaction Details
TargetNH(3)-dependent NAD(+) synthetase
LigandBDBM50130839
Substrate/Competitorn/a
Meas. Tech.ChEMBL_141613 (CHEMBL747929)
IC50>1000000±n/a nM
Citation Velu, SECristofoli, WAGarcia, GJBrouillette, CGPierson, MCLuan, CHDeLucas, LJBrouillette, WJ Tethered dimers as NAD synthetase inhibitors with antibacterial activity. J Med Chem46:3371-81 (2003) 
 
NH(3)-dependent NAD(+) synthetase
Name:NH(3)-dependent NAD(+) synthetase
Type:PROTEIN
Mol. Mass.:30386.77
Organism:Bacillus subtilis
Description:ChEMBL_141613
Residue:272
BDBM50130839
NameBDBM50130839
Synonyms:1-Methyl-3-[4-(5-nitro-indol-1-yl)-butoxycarbonyl]-pyridinium; iodide | CHEMBL114765
TypeSmall organic molecule
Emp. Form.C19H20N3O4
Mol. Mass.354.3793
SMILESC[n+]1cccc(c1)C(=O)OCCCCn1ccc2cc(ccc12)[N+]([O-])=O