Reaction Details
TargetPurine nucleoside phosphorylase
LigandBDBM50370256
Substrate/Competitorn/a
Meas. Tech.ChEMBL_162193 (CHEMBL766712)
Ki 1.4±n/a nM
Citation Evans, GBFurneaux, RHLewandowicz, ASchramm, VLTyler, PC Exploring structure-activity relationships of transition state analogues of human purine nucleoside phosphorylase. J Med Chem46:3412-23 (2003) 
 
Purine nucleoside phosphorylase
Name:Purine nucleoside phosphorylase
Type:Enzyme
Mol. Mass.:32119.53
Organism:Homo sapiens (Human)
Description:n/a
Residue:289
BDBM50370256
NameBDBM50370256
Synonyms:CHEMBL541578
TypeSmall organic molecule
Emp. Form.C11H12F2N4O3
Mol. Mass.286.2348
SMILESOC[C@H]1N[C@@H](c2c[nH]c3c2nc[nH]c3=O)C(F)(F)[C@H]1O