Reaction Details
TargetCorticotropin-releasing factor receptor 1
LigandBDBM50131716
Substrate/Competitorn/a
Meas. Tech.ChEMBL_51128 (CHEMBL663563)
Ki 1.9±n/a nM
Citation Jagoda, EContoreggi, CLee, MJKao, CHSzajek, LPListwak, SGold, PChrousos, GGreiner, EKim, BMJacobson, AERice, KCEckelman, W Autoradiographic visualization of corticotropin releasing hormone type 1 receptors with a nonpeptide ligand: synthesis of [(76)Br]MJL-1-109-2. J Med Chem46:3559-62 (2003) 
 
Corticotropin-releasing factor receptor 1
Name:Corticotropin-releasing factor receptor 1
Type:G Protein-Coupled Receptor (GPCR)
Mol. Mass.:47870.75
Organism:Rattus norvegicus (rat)
Description:Receptor binding assays were performed using rat cortex homogenate.
Residue:415
BDBM50131716
NameBDBM50131716
Synonyms:CHEMBL430892 | [3-(4-Bromo-2-chloro-phenyl)-2,5-dimethyl-[1,2,4]triazolo[1,5-a][1,3,5]triazin-7-yl]-bis-(2-methoxy-ethyl)-amine
TypeSmall organic molecule
Emp. Form.C19H23BrClN5O2
Mol. Mass.468.775
SMILESCOCCN(CCOC)c1nc(C)nc2c(c(C)nn12)-c1ccc(Br)cc1Cl