Reaction Details
TargetMajor prion protein
LigandBDBM50015214
Substrate/Competitorn/a
Meas. Tech.ChEMBL_158887 (CHEMBL760875)
EC50 300±n/a nM
Citation Vogtherr, MGrimme, SElshorst, BJacobs, DMFiebig, KGriesinger, CZahn, R Antimalarial drug quinacrine binds to C-terminal helix of cellular prion protein. J Med Chem46:3563-4 (2003) 
 
Major prion protein
Name:Major prion protein
Type:PROTEIN
Mol. Mass.:27671.97
Organism:Homo sapiens (Human)
Description:ChEMBL_158887
Residue:253
BDBM50015214
NameBDBM50015214
Synonyms:6-chloro-2-methoxy-9-acridinyl(4-diethylamino-1-methylbutyl)amine CHEMBL7568 N*4*-(6-Chloro-2-methoxy-acridin-9-yl)-N*1*,N*1*-diethyl-pentane-1,4-diamine N*4*-(6-Chloro-2-methoxy-acridin-9-yl)-N*1*,N*1*-diethyl-pentane-1,4-diamine ; (mepacrine) cid_237 | quinacrine
TypeSmall organic molecule
Emp. Form.C23H30ClN3O
Mol. Mass.399.957
SMILESCCN(CC)CCCC(C)Nc1c2ccc(Cl)cc2nc2ccc(OC)cc12