Reaction Details
TargetProthrombin
LigandBDBM50131778
Substrate/Competitorn/a
Meas. Tech.ChEMBL_208359 (CHEMBL813669)
Ki 0.01±n/a nM
Citation Lee, KPark, CWJung, WHPark, HDLee, SHChung, KHPark, SKKwon, OHKang, MPark, DHLee, SKKim, EEYoon, SKKim, A Efficacious and orally bioavailable thrombin inhibitors based on a 2,5-thienylamidine at the P1 position: discovery of N-carboxymethyl-d-diphenylalanyl-l-prolyl[(5-amidino-2-thienyl)methyl]amide. J Med Chem46:3612-22 (2003) 
 
Prothrombin
Name:Prothrombin
Type:Protein
Mol. Mass.:70029.57
Organism:Homo sapiens (Human)
Description:P00734
Residue:622
BDBM50131778
NameBDBM50131778
Synonyms:3-(1-Benzhydryl-2-{2-[(5-carbamimidoyl-thiophen-2-ylmethyl)-carbamoyl]-pyrrolidin-1-yl}-2-oxo-ethylamino)-propionic acid | CHEMBL120079
TypeSmall organic molecule
Emp. Form.C29H33N5O4S
Mol. Mass.547.668
SMILESNC(=N)c1ccc(CNC(=O)[C@@H]2CCCN2C(=O)[C@H](NCCC(O)=O)C(c2ccccc2)c2ccccc2)s1