Reaction Details
TargetProthrombin
LigandBDBM50131790
Substrate/Competitorn/a
Meas. Tech.ChEMBL_208359 (CHEMBL813669)
Ki 0.008±n/a nM
Citation Lee, KPark, CWJung, WHPark, HDLee, SHChung, KHPark, SKKwon, OHKang, MPark, DHLee, SKKim, EEYoon, SKKim, A Efficacious and orally bioavailable thrombin inhibitors based on a 2,5-thienylamidine at the P1 position: discovery of N-carboxymethyl-d-diphenylalanyl-l-prolyl[(5-amidino-2-thienyl)methyl]amide. J Med Chem46:3612-22 (2003) 
 
Prothrombin
Name:Prothrombin
Type:Protein
Mol. Mass.:70029.57
Organism:Homo sapiens (Human)
Description:P00734
Residue:622
BDBM50131790
NameBDBM50131790
Synonyms:1-(2-sulfonamideamino-3,3-diphenyl-propionyl)-pyrrolidine-2-carboxylic acid 4-carbamimidoyl-3-fluoro-benzylamide | CHEMBL331847
TypeSmall organic molecule
Emp. Form.C28H31FN6O4S
Mol. Mass.566.647
SMILESNC(=N)c1ccc(CNC(=O)[C@@H]2CCCN2C(=O)[C@H](NS(N)(=O)=O)C(c2ccccc2)c2ccccc2)cc1F