Reaction Details
TargetProthrombin
LigandBDBM50111120
Substrate/Competitorn/a
Meas. Tech.ChEMBL_208359 (CHEMBL813669)
Ki 0.013±n/a nM
Citation Lee, KPark, CWJung, WHPark, HDLee, SHChung, KHPark, SKKwon, OHKang, MPark, DHLee, SKKim, EEYoon, SKKim, A Efficacious and orally bioavailable thrombin inhibitors based on a 2,5-thienylamidine at the P1 position: discovery of N-carboxymethyl-d-diphenylalanyl-l-prolyl[(5-amidino-2-thienyl)methyl]amide. J Med Chem46:3612-22 (2003) 
 
Prothrombin
Name:Prothrombin
Type:Protein
Mol. Mass.:70029.57
Organism:Homo sapiens (Human)
Description:P00734
Residue:622
BDBM50111120
NameBDBM50111120
Synonyms:2N-(4-Benzamidinemethyl)-1-[2-Aminoaceticacid-3,3-diphenyl-(2R)-propanoyl]-(2S)-tetrahydro-1H-2-pyrrolecarboxamide;TFA | CHEMBL330949
TypeSmall organic molecule
Emp. Form.C30H33N5O4
Mol. Mass.527.6141
SMILESNC(=N)c1ccc(CNC(=O)[C@@H]2CCCN2C(=O)[C@H](NCC(O)=O)C(c2ccccc2)c2ccccc2)cc1