Reaction Details
TargetThymidine kinase, cytosolic
LigandBDBM50131914
Substrate/Competitorn/a
Meas. Tech.ChEMBL_208213 (CHEMBL815478)
Ki 4700±n/a nM
Citation Vanheusden, VMunier-Lehmann, HFroeyen, MDugué, LHeyerick, ADe Keukeleire, DPochet, SBusson, RHerdewijn, PVan Calenbergh, S 3'-C-branched-chain-substituted nucleosides and nucleotides as potent inhibitors of Mycobacterium tuberculosis thymidine monophosphate kinase. J Med Chem46:3811-21 (2003) 
 
Thymidine kinase, cytosolic
Name:Thymidine kinase, cytosolic
Type:PROTEIN
Mol. Mass.:25476.50
Organism:Homo sapiens (Human)
Description:ChEMBL_1333884
Residue:234
BDBM50131914
NameBDBM50131914
Synonyms:Phosphoric acid mono-[3-aminomethyl-5-(5-methyl-2,4-dioxo-3,4-dihydro-2H-pyrimidin-1-yl)-tetrahydro-furan-2-ylmethyl] ester
TypeSmall organic molecule
Emp. Form.C11H16N3O7P
Mol. Mass.333.2355
SMILESCc1cn([C@H]2C[C@H](CN)[C@@H](COP([O-])([O-])=O)O2)c(=O)[nH]c1=O