Reaction Details
TargetThymidylate kinase
LigandBDBM50131917
Substrate/Competitorn/a
Meas. Tech.ChEMBL_208211 (CHEMBL873990)
Ki 156000±n/a nM
Citation Vanheusden, VMunier-Lehmann, HFroeyen, MDugué, LHeyerick, ADe Keukeleire, DPochet, SBusson, RHerdewijn, PVan Calenbergh, S 3'-C-branched-chain-substituted nucleosides and nucleotides as potent inhibitors of Mycobacterium tuberculosis thymidine monophosphate kinase. J Med Chem46:3811-21 (2003) 
 
Thymidylate kinase
Name:Thymidylate kinase
Type:PROTEIN
Mol. Mass.:22636.29
Organism:Mycobacterium tuberculosis
Description:ChEMBL_208218
Residue:214
BDBM50131917
NameBDBM50131917
Synonyms:1-[4-(2-Hydroxy-ethyl)-5-hydroxymethyl-tetrahydro-furan-2-yl]-5-methyl-1H-pyrimidine-2,4-dione | CHEMBL124814
TypeSmall organic molecule
Emp. Form.C12H18N2O5
Mol. Mass.270.2817
SMILESCc1cn([C@H]2C[C@H](CCO)[C@@H](CO)O2)c(=O)[nH]c1=O