Reaction Details
TargetThymidylate kinase
LigandBDBM50131919
Substrate/Competitorn/a
Meas. Tech.ChEMBL_208211 (CHEMBL873990)
Ki 770000±n/a nM
Citation Vanheusden, VMunier-Lehmann, HFroeyen, MDugué, LHeyerick, ADe Keukeleire, DPochet, SBusson, RHerdewijn, PVan Calenbergh, S 3'-C-branched-chain-substituted nucleosides and nucleotides as potent inhibitors of Mycobacterium tuberculosis thymidine monophosphate kinase. J Med Chem46:3811-21 (2003) 
 
Thymidylate kinase
Name:Thymidylate kinase
Type:PROTEIN
Mol. Mass.:22636.29
Organism:Mycobacterium tuberculosis
Description:ChEMBL_208218
Residue:214
BDBM50131919
NameBDBM50131919
Synonyms:1-(4-Azidomethyl-3-hydroxy-5-hydroxymethyl-tetrahydro-furan-2-yl)-5-methyl-1H-pyrimidine-2,4-dione | CHEMBL123912
TypeSmall organic molecule
Emp. Form.C11H15N5O5
Mol. Mass.297.2673
SMILESCc1cn([C@@H]2O[C@H](CO)[C@@H](CN=[N+]=[N-])[C@H]2O)c(=O)[nH]c1=O